{"text_format":"1","workbook":"xlsx","n_sheets":6,"sheets":["411_B_CRITERI","CR_3_GRIGLIA","Dettaglio_Investimenti","Calcolo_Punteggio","ELENCHI","Sub_Interventi"],"not_rendered":{"charts":0,"images":0,"macros":1,"external_links":0,"defined_names":10,"comments":0,"pivot_tables":1},"unopened":[],"bounds":{"document_bytes":16777216,"sheet_cells":100000,"rows_first":2000,"rows_last":500,"rows_between":2000,"halvings":0,"cell_chars":16384,"cell_head_chars":4096},"cells_cut":0,"cells_raw":0,"read":"whole","date_system":"1900"}

{"sheet":"411_B_CRITERI","index":0,"n_rows":53,"n_cols":12,"rows_kept":53,"cut":false,"hidden":false,"merged":[[0,7,2,7],[1,11,2,11],[1,0,1,2],[48,0,48,5],[0,1,0,2],[15,0,15,1],[4,0,4,1],[31,1,35,1],[30,0,30,1],[47,2,47,4],[46,2,46,4],[37,0,37,1],[3,0,3,1],[6,0,12,0],[38,1,45,1],[36,0,36,1],[31,0,35,0],[43,5,45,5],[0,4,0,6],[43,6,45,6],[39,5,41,5],[39,6,41,6],[3,7,4,7],[31,3,31,5],[32,7,35,7],[38,3,38,5],[42,3,42,5],[32,5,35,5],[37,4,37,6],[36,4,36,5],[18,7,21,7],[39,7,41,7],[3,4,3,5],[6,5,12,5],[6,6,12,6],[4,4,4,6],[24,0,28,0],[30,4,30,6],[14,0,14,1],[22,0,22,1],[23,0,23,1],[17,0,21,0],[17,1,21,1],[29,4,29,5],[29,0,29,1],[16,3,16,4],[24,3,24,5],[17,3,17,5],[25,5,28,5],[18,5,21,5],[18,6,21,6],[25,6,28,6],[18,11,21,11],[32,11,35,11],[25,10,28,10],[32,8,35,8],[32,9,35,9],[32,6,35,6],[6,1,12,1],[24,1,28,1],[6,11,12,11],[25,11,28,11],[6,7,12,7],[25,7,28,7],[14,4,14,5],[15,4,15,6],[23,4,23,6],[22,4,22,5],[6,8,12,8],[6,9,12,9],[18,8,21,8],[18,9,21,9],[25,8,28,8],[25,9,28,9],[43,7,45,7],[39,11,41,11],[43,9,45,9],[43,8,45,8],[43,11,45,11],[39,8,41,8],[39,9,41,9],[39,10,41,10],[50,0,50,5],[50,6,50,11],[51,0,51,5],[51,6,51,11],[52,3,52,5]]}
["DITTA",null,null,"CUAA",null,null,null,"documento attestante il diritto alla premialità (sezione per il richiedente)",null,null,null,"ISTRUTTORIA"]
["Per compilare la scheda relativa al punteggio, cliccare su \"Inizia Autovalutazione\"",null,null,null,null,null,null,null,null,null,null,"Per l'attività istruttoria cliccare su \"Inizia Istruttoria\""]
[null,null,{"$f":"+IF(D3<>\"\",\"verifica il punteggio attribuito ai singoli criteri!\",\"\")","v":""},{"$f":"IF(SUMIF(C4:D46,\"punteggio max\",D4:D46)<>100,SUMIF(C4:D46,\"punteggio max\",D4:D46),\"\")","v":""}]
["1 -  Tipologia di richiedente",null,"punteggio max",17,"RICHIEDENTE",null,"ISTRUTTORIA",{"$f":"CONCATENATE(I6,\" - \",I7,\" - \",I14,\" - \",I17,\" - \",I19,\" - \",I26,\" - \",I33,\" - \",I40,\" - \",I41,\" - \",I44,\" - \",I46)","v":"  -   -   -   -   -  -  -   -  -   - "}]
["Descrizione",null,"Modalità di attribuzione","punti","punteggio attribuito"]
["1.1","Imprese condotte da giovani agricoltori di cui all'art. 2, lett. n) del Reg. 1305/2013 che presentino la domanda di aiuto entro i 5 anni dal primo insediamento.","Per l'attribuzione del punteggio dovrà essere soddisfatta la seguente condizione: alla data di rilascio sul portale SIAN della domanda di aiuto, il richiedente (titolare di ditta individuale o rappresentante legale nel caso delle società) non deve avere un'età superiore a 40 anni (41 anni non compiuti), non deve essersi insediato da più di 5 anni e deve avere adeguate qualifiche e competenze professionali",10,false,{"$f":"+IF(E6=TRUE,D6,0)","v":0},null,null,{"$f":"+IF(AND(H6<>0,F6=0),\"verifica criterio 1.1\",\" \")","v":" "},{"$f":"+IF(I6<>\" \",\"V\",1)","v":1}]
["1.2","Titolo di studio e formazione","Titolare o rappresentante legale  con titolo di studio universitario del vecchio ordinamento o laurea magistrale (già specialistica) attinente al settore agrario, forestale o veterinario, come riconosciuto dalla classificazione normativa vigente",5,7,{"$f":"+IF(E7=1,D7,IF(E7=2,D8,IF(E7=3,D9,IF(E7=4,D10,IF(E7=5,D11,IF(E7=6,D12,IF(E7=7,D13,IF(E7=7,D14,0))))))))","v":0},null,null,{"$f":"+IF(AND(H7<>0,F7=0),\"verifica criterio 1.2\",\" \")","v":" "},{"$f":"+IF(I7<>\" \",\"V\",1)","v":1}]
[null,null,"Titolare o rappresentante legale con titolo di studio universitario triennale attinente al settore agrario, forestale o veterinario, come riconosciuto dalla classificazione normativa vigente",4]
[null,null,"Titolare o rappresentante legale con titolo di studio quinquennale di scuola secondaria di secondo grado attinente al settore agrario",3]
[null,null,"Titolare o rappresentante legale con titolo di studio universitario del vecchio ordinamento o laurea magistrale (già specialistica) attinente altri settori",2]
[null,null,"Titolare o rappresentante legale con titolo di studio universitario triennale attinente altri settori.",1]
[null,null,"Attestazione per 100 ore di formazione con profitto in materie agrarie, forestali e zootecniche",1]
[null,null,"nessun titolo da valutare",0]
["1.3","Adesione alla rete del lavoro agricolo di qualità ","Adesione, alla data del rilascio della domanda di sostegno, alla rete del lavoro agricolo di qualità del lavoro agricolo di cui alla legge n. 199 del 2016",2,false,{"$f":"IF(E14=TRUE,D14,0)","v":0},null,null,{"$f":"+IF(AND(H14<>0,F14=0),\"verifica criterio 1.3\",\" \")","v":" "},{"$f":"+IF(I14<>\" \",\"V\",1)","v":1}]
["2 - Caratteristiche tecniche del progetto",null,"punteggio max",48,"RICHIEDENTE",null,"ISTRUTTORIA"]
{"$rows_left_out":39}
{"sheet":"CR_3_GRIGLIA","index":1,"n_rows":22,"n_cols":4,"rows_kept":22,"cut":false,"hidden":false,"merged":[]}
["codice investimento","INVESTIMENTI",null,"Filiera Bufalina"]
[null,null,null,1]
[4110001001,"miglioramenti fondiari per la realizzazione degli elementi strutturali per la gestione dei pascoli aziendali; \ni drenaggi sono esclusi",1,30]
[4110001002,"Ristrutturazione/ammodernamento di fabbricati per trasformazione e commercializzazione, lavorazione dei prodotti dell’allevamento provenienti dall’attività aziendale alle seguenti condizioni:\n1 - il prodotto in uscita (output) deve sempre essere compreso nei prodotti dell'allegato I del TFUE\n2 - la spesa ammessa relativa alle specifiche macchine, attrezzature e impianti deve essere ≥ 25% della spesa ammessa per questo investimento\n3 - la materia prima (latte/carne) deve provenire per più del 50% dall'allevamento ",2,43]
[4110001003,"Costruzione ex novo di fabbricati per trasformazione e commercializzazione, lavorazione dei prodotti dell’allevamento provenienti dall’attività aziendale alle seguenti condizioni:\n1 - il prodotto in uscita (output) deve sempre essere compreso nei prodotti dell'allegato I del TFUE\n2 - la spesa ammessa relativa alle specifiche macchine, attrezzature e impianti deve essere ≥ 25% della spesa ammessa per questo investimento\n3 - la materia prima (latte/carne) deve provenire per più del 50% dall'allevamento",3,35]
[4110001004,"Ristrutturazione/ammodernamento di stalla, sala mungitura, paddock",4,35]
[4110001005,"Costruzione ex novo di stalla, sala mungitura, paddock",5,30]
[4110001006,"Ristrutturazione/ammodernamento di fienile e depositi",6,20]
[4110001007,"Costruzione ex novo di fienile e depositi",7,15]
[4110001008,"Realizzare interventi sulle strutture di allevamento o impianti e attrezzature per migliorare il microclima negli allevamenti, riduzione delle emissioni in atmosfera o finalizzati alla biosicurezza, compresi nell'elenco allegato al bando",8,43]
[4110001009,"Trattrici/macchine/attrezzature innovative incluse nell’elenco allegato al bando",9,35]
[4110001010,"Realizzazione di strade poderali, spazi per la manovra dei mezzi agricoli, recinzioni e tutti gli altri investimenti non compresi nelle voci precedenti",10,0]
[]
[null,"Priorità","Punteggio"]
[null,"Altamente strategica - verde (V)",43]
{"$rows_left_out":8}
{"sheet":"Dettaglio_Investimenti","index":2,"n_rows":55,"n_cols":10,"rows_kept":55,"cut":false,"hidden":false,"merged":[]}
["ID","codice investimento","Investimento","Settore","sub intervento in domanda di sostegno","Importo","Tipo Investimento","% Investimento","Punteggio TipoInvestimento","Punteggio Pesato"]
[1,null,{"$f":"+IF(B2=\"\",\"\",VLOOKUP(B2,CR_3_GRIGLIA!$A$3:$B$12,2,FALSE))","v":""},null,null,null,{"$f":"+IF(I2=\"\",\"\",IF(I2=CR_3_GRIGLIA!$C$15,CR_3_GRIGLIA!$B$15,IF(I2=CR_3_GRIGLIA!$C$16,CR_3_GRIGLIA!$B$16,IF(I2=CR_3_GRIGLIA!$C$17,CR_3_GRIGLIA!$B$17,IF(I2=CR_3_GRIGLIA!$C$18,CR_3_GRIGLIA!$B$18,CR_3_GRIGLIA!$B$20)))))","v":""},{"$f":"IFERROR(IF(F2=\"\",\"\",F2/$F$55),0)","v":""},{"$f":"+IF(D2=\"\",\"\",IF(C2=\"\",0,INDEX(CR_3_GRIGLIA!$D$3:$D$12,+VLOOKUP(B2,CR_3_GRIGLIA!$A$3:$C$12,3,FALSE),+HLOOKUP(D2,CR_3_GRIGLIA!$D$1:$D$2,2,FALSE))))","v":""},{"$f":"IFERROR(IF(I2=\"\",\"\",I2*F2/$F$55),0)","v":""}]
[2,null,{"$f":"+IF(B3=\"\",\"\",VLOOKUP(B3,CR_3_GRIGLIA!$A$3:$B$12,2,FALSE))","v":""},null,null,null,{"$f":"+IF(I3=\"\",\"\",IF(I3=CR_3_GRIGLIA!$C$15,CR_3_GRIGLIA!$B$15,IF(I3=CR_3_GRIGLIA!$C$16,CR_3_GRIGLIA!$B$16,IF(I3=CR_3_GRIGLIA!$C$17,CR_3_GRIGLIA!$B$17,IF(I3=CR_3_GRIGLIA!$C$18,CR_3_GRIGLIA!$B$18,CR_3_GRIGLIA!$B$20)))))","v":""},{"$f":"IFERROR(IF(F3=\"\",\"\",F3/$F$55),0)","v":""},{"$f":"+IF(D3=\"\",\"\",IF(C3=\"\",0,INDEX(CR_3_GRIGLIA!$D$3:$D$12,+VLOOKUP(B3,CR_3_GRIGLIA!$A$3:$C$12,3,FALSE),+HLOOKUP(D3,CR_3_GRIGLIA!$D$1:$D$2,2,FALSE))))","v":""},{"$f":"IFERROR(IF(I3=\"\",\"\",I3*F3/$F$55),0)","v":""}]
[3,null,{"$f":"+IF(B4=\"\",\"\",VLOOKUP(B4,CR_3_GRIGLIA!$A$3:$B$12,2,FALSE))","v":""},null,null,null,{"$f":"+IF(I4=\"\",\"\",IF(I4=CR_3_GRIGLIA!$C$15,CR_3_GRIGLIA!$B$15,IF(I4=CR_3_GRIGLIA!$C$16,CR_3_GRIGLIA!$B$16,IF(I4=CR_3_GRIGLIA!$C$17,CR_3_GRIGLIA!$B$17,IF(I4=CR_3_GRIGLIA!$C$18,CR_3_GRIGLIA!$B$18,CR_3_GRIGLIA!$B$20)))))","v":""},"",{"$f":"+IF(D4=\"\",\"\",IF(C4=\"\",0,INDEX(CR_3_GRIGLIA!$D$3:$D$12,+VLOOKUP(B4,CR_3_GRIGLIA!$A$3:$C$12,3,FALSE),+HLOOKUP(D4,CR_3_GRIGLIA!$D$1:$D$2,2,FALSE))))","v":""},""]
[4,null,{"$f":"+IF(B5=\"\",\"\",VLOOKUP(B5,CR_3_GRIGLIA!$A$3:$B$12,2,FALSE))","v":""},null,null,null,{"$f":"+IF(I5=\"\",\"\",IF(I5=CR_3_GRIGLIA!$C$15,CR_3_GRIGLIA!$B$15,IF(I5=CR_3_GRIGLIA!$C$16,CR_3_GRIGLIA!$B$16,IF(I5=CR_3_GRIGLIA!$C$17,CR_3_GRIGLIA!$B$17,IF(I5=CR_3_GRIGLIA!$C$18,CR_3_GRIGLIA!$B$18,CR_3_GRIGLIA!$B$20)))))","v":""},"",{"$f":"+IF(D5=\"\",\"\",IF(C5=\"\",0,INDEX(CR_3_GRIGLIA!$D$3:$D$12,+VLOOKUP(B5,CR_3_GRIGLIA!$A$3:$C$12,3,FALSE),+HLOOKUP(D5,CR_3_GRIGLIA!$D$1:$D$2,2,FALSE))))","v":""},""]
[5,null,{"$f":"+IF(B6=\"\",\"\",VLOOKUP(B6,CR_3_GRIGLIA!$A$3:$B$12,2,FALSE))","v":""},null,null,null,{"$f":"+IF(I6=\"\",\"\",IF(I6=CR_3_GRIGLIA!$C$15,CR_3_GRIGLIA!$B$15,IF(I6=CR_3_GRIGLIA!$C$16,CR_3_GRIGLIA!$B$16,IF(I6=CR_3_GRIGLIA!$C$17,CR_3_GRIGLIA!$B$17,IF(I6=CR_3_GRIGLIA!$C$18,CR_3_GRIGLIA!$B$18,CR_3_GRIGLIA!$B$20)))))","v":""},"",{"$f":"+IF(D6=\"\",\"\",IF(C6=\"\",0,INDEX(CR_3_GRIGLIA!$D$3:$D$12,+VLOOKUP(B6,CR_3_GRIGLIA!$A$3:$C$12,3,FALSE),+HLOOKUP(D6,CR_3_GRIGLIA!$D$1:$D$2,2,FALSE))))","v":""},""]
[6,null,{"$f":"+IF(B7=\"\",\"\",VLOOKUP(B7,CR_3_GRIGLIA!$A$3:$B$12,2,FALSE))","v":""},null,null,null,{"$f":"+IF(I7=\"\",\"\",IF(I7=CR_3_GRIGLIA!$C$15,CR_3_GRIGLIA!$B$15,IF(I7=CR_3_GRIGLIA!$C$16,CR_3_GRIGLIA!$B$16,IF(I7=CR_3_GRIGLIA!$C$17,CR_3_GRIGLIA!$B$17,IF(I7=CR_3_GRIGLIA!$C$18,CR_3_GRIGLIA!$B$18,CR_3_GRIGLIA!$B$20)))))","v":""},"",{"$f":"+IF(D7=\"\",\"\",IF(C7=\"\",0,INDEX(CR_3_GRIGLIA!$D$3:$D$12,+VLOOKUP(B7,CR_3_GRIGLIA!$A$3:$C$12,3,FALSE),+HLOOKUP(D7,CR_3_GRIGLIA!$D$1:$D$2,2,FALSE))))","v":""},""]
[7,null,{"$f":"+IF(B8=\"\",\"\",VLOOKUP(B8,CR_3_GRIGLIA!$A$3:$B$12,2,FALSE))","v":""},null,null,null,{"$f":"+IF(I8=\"\",\"\",IF(I8=CR_3_GRIGLIA!$C$15,CR_3_GRIGLIA!$B$15,IF(I8=CR_3_GRIGLIA!$C$16,CR_3_GRIGLIA!$B$16,IF(I8=CR_3_GRIGLIA!$C$17,CR_3_GRIGLIA!$B$17,IF(I8=CR_3_GRIGLIA!$C$18,CR_3_GRIGLIA!$B$18,CR_3_GRIGLIA!$B$20)))))","v":""},"",{"$f":"+IF(D8=\"\",\"\",IF(C8=\"\",0,INDEX(CR_3_GRIGLIA!$D$3:$D$12,+VLOOKUP(B8,CR_3_GRIGLIA!$A$3:$C$12,3,FALSE),+HLOOKUP(D8,CR_3_GRIGLIA!$D$1:$D$2,2,FALSE))))","v":""},""]
[8,null,{"$f":"+IF(B9=\"\",\"\",VLOOKUP(B9,CR_3_GRIGLIA!$A$3:$B$12,2,FALSE))","v":""},null,null,null,{"$f":"+IF(I9=\"\",\"\",IF(I9=CR_3_GRIGLIA!$C$15,CR_3_GRIGLIA!$B$15,IF(I9=CR_3_GRIGLIA!$C$16,CR_3_GRIGLIA!$B$16,IF(I9=CR_3_GRIGLIA!$C$17,CR_3_GRIGLIA!$B$17,IF(I9=CR_3_GRIGLIA!$C$18,CR_3_GRIGLIA!$B$18,CR_3_GRIGLIA!$B$20)))))","v":""},"",{"$f":"+IF(D9=\"\",\"\",IF(C9=\"\",0,INDEX(CR_3_GRIGLIA!$D$3:$D$12,+VLOOKUP(B9,CR_3_GRIGLIA!$A$3:$C$12,3,FALSE),+HLOOKUP(D9,CR_3_GRIGLIA!$D$1:$D$2,2,FALSE))))","v":""},""]
[9,null,{"$f":"+IF(B10=\"\",\"\",VLOOKUP(B10,CR_3_GRIGLIA!$A$3:$B$12,2,FALSE))","v":""},null,null,null,{"$f":"+IF(I10=\"\",\"\",IF(I10=CR_3_GRIGLIA!$C$15,CR_3_GRIGLIA!$B$15,IF(I10=CR_3_GRIGLIA!$C$16,CR_3_GRIGLIA!$B$16,IF(I10=CR_3_GRIGLIA!$C$17,CR_3_GRIGLIA!$B$17,IF(I10=CR_3_GRIGLIA!$C$18,CR_3_GRIGLIA!$B$18,CR_3_GRIGLIA!$B$20)))))","v":""},"",{"$f":"+IF(D10=\"\",\"\",IF(C10=\"\",0,INDEX(CR_3_GRIGLIA!$D$3:$D$12,+VLOOKUP(B10,CR_3_GRIGLIA!$A$3:$C$12,3,FALSE),+HLOOKUP(D10,CR_3_GRIGLIA!$D$1:$D$2,2,FALSE))))","v":""},""]
[10,null,{"$f":"+IF(B11=\"\",\"\",VLOOKUP(B11,CR_3_GRIGLIA!$A$3:$B$12,2,FALSE))","v":""},null,null,null,{"$f":"+IF(I11=\"\",\"\",IF(I11=CR_3_GRIGLIA!$C$15,CR_3_GRIGLIA!$B$15,IF(I11=CR_3_GRIGLIA!$C$16,CR_3_GRIGLIA!$B$16,IF(I11=CR_3_GRIGLIA!$C$17,CR_3_GRIGLIA!$B$17,IF(I11=CR_3_GRIGLIA!$C$18,CR_3_GRIGLIA!$B$18,CR_3_GRIGLIA!$B$20)))))","v":""},"",{"$f":"+IF(D11=\"\",\"\",IF(C11=\"\",0,INDEX(CR_3_GRIGLIA!$D$3:$D$12,+VLOOKUP(B11,CR_3_GRIGLIA!$A$3:$C$12,3,FALSE),+HLOOKUP(D11,CR_3_GRIGLIA!$D$1:$D$2,2,FALSE))))","v":""},""]
[11,null,{"$f":"+IF(B12=\"\",\"\",VLOOKUP(B12,CR_3_GRIGLIA!$A$3:$B$12,2,FALSE))","v":""},null,null,null,{"$f":"+IF(I12=\"\",\"\",IF(I12=CR_3_GRIGLIA!$C$15,CR_3_GRIGLIA!$B$15,IF(I12=CR_3_GRIGLIA!$C$16,CR_3_GRIGLIA!$B$16,IF(I12=CR_3_GRIGLIA!$C$17,CR_3_GRIGLIA!$B$17,IF(I12=CR_3_GRIGLIA!$C$18,CR_3_GRIGLIA!$B$18,CR_3_GRIGLIA!$B$20)))))","v":""},"",{"$f":"+IF(D12=\"\",\"\",IF(C12=\"\",0,INDEX(CR_3_GRIGLIA!$D$3:$D$12,+VLOOKUP(B12,CR_3_GRIGLIA!$A$3:$C$12,3,FALSE),+HLOOKUP(D12,CR_3_GRIGLIA!$D$1:$D$2,2,FALSE))))","v":""},""]
[12,null,{"$f":"+IF(B13=\"\",\"\",VLOOKUP(B13,CR_3_GRIGLIA!$A$3:$B$12,2,FALSE))","v":""},null,null,null,{"$f":"+IF(I13=\"\",\"\",IF(I13=CR_3_GRIGLIA!$C$15,CR_3_GRIGLIA!$B$15,IF(I13=CR_3_GRIGLIA!$C$16,CR_3_GRIGLIA!$B$16,IF(I13=CR_3_GRIGLIA!$C$17,CR_3_GRIGLIA!$B$17,IF(I13=CR_3_GRIGLIA!$C$18,CR_3_GRIGLIA!$B$18,CR_3_GRIGLIA!$B$20)))))","v":""},"",{"$f":"+IF(D13=\"\",\"\",IF(C13=\"\",0,INDEX(CR_3_GRIGLIA!$D$3:$D$12,+VLOOKUP(B13,CR_3_GRIGLIA!$A$3:$C$12,3,FALSE),+HLOOKUP(D13,CR_3_GRIGLIA!$D$1:$D$2,2,FALSE))))","v":""},""]
[13,null,{"$f":"+IF(B14=\"\",\"\",VLOOKUP(B14,CR_3_GRIGLIA!$A$3:$B$12,2,FALSE))","v":""},null,null,null,{"$f":"+IF(I14=\"\",\"\",IF(I14=CR_3_GRIGLIA!$C$15,CR_3_GRIGLIA!$B$15,IF(I14=CR_3_GRIGLIA!$C$16,CR_3_GRIGLIA!$B$16,IF(I14=CR_3_GRIGLIA!$C$17,CR_3_GRIGLIA!$B$17,IF(I14=CR_3_GRIGLIA!$C$18,CR_3_GRIGLIA!$B$18,CR_3_GRIGLIA!$B$20)))))","v":""},"",{"$f":"+IF(D14=\"\",\"\",IF(C14=\"\",0,INDEX(CR_3_GRIGLIA!$D$3:$D$12,+VLOOKUP(B14,CR_3_GRIGLIA!$A$3:$C$12,3,FALSE),+HLOOKUP(D14,CR_3_GRIGLIA!$D$1:$D$2,2,FALSE))))","v":""},""]
[14,null,{"$f":"+IF(B15=\"\",\"\",VLOOKUP(B15,CR_3_GRIGLIA!$A$3:$B$12,2,FALSE))","v":""},null,null,null,{"$f":"+IF(I15=\"\",\"\",IF(I15=CR_3_GRIGLIA!$C$15,CR_3_GRIGLIA!$B$15,IF(I15=CR_3_GRIGLIA!$C$16,CR_3_GRIGLIA!$B$16,IF(I15=CR_3_GRIGLIA!$C$17,CR_3_GRIGLIA!$B$17,IF(I15=CR_3_GRIGLIA!$C$18,CR_3_GRIGLIA!$B$18,CR_3_GRIGLIA!$B$20)))))","v":""},"",{"$f":"+IF(D15=\"\",\"\",IF(C15=\"\",0,INDEX(CR_3_GRIGLIA!$D$3:$D$12,+VLOOKUP(B15,CR_3_GRIGLIA!$A$3:$C$12,3,FALSE),+HLOOKUP(D15,CR_3_GRIGLIA!$D$1:$D$2,2,FALSE))))","v":""},""]
{"$rows_left_out":41}
{"sheet":"Calcolo_Punteggio","index":3,"n_rows":60,"n_cols":20,"rows_kept":60,"cut":false,"hidden":false,"merged":[[1,1,1,2],[1,3,2,3],[1,4,2,4]]}
[null,"Settore",null,null,null,null,null,null,null,null,null,null,null,null,null,null,null,null,null,1]
[null,"(vuoto)",null,"Valore totale","Punteggio totale",null,null,null,null,null,null,null,null,null,null,null,null,null,null,2]
["Investimento","Valore","Punteggio",null,null,null,null,null,null,null,null,null,null,null,null,null,null,null,null,3]
[null,null,0,null,0,null,null,null,null,null,null,null,null,null,null,null,null,null,null,4]
[null,null,0,null,0,null,null,null,null,null,null,null,null,null,null,null,null,null,null,5]
["Totale complessivo",null,0,null,0,null,null,null,null,null,null,null,null,null,null,null,null,null,null,6]
[null,null,null,null,null,null,null,null,null,null,null,null,null,null,null,null,null,null,null,7]
[null,null,null,null,null,null,null,null,null,null,null,null,null,null,null,null,null,null,null,8]
[null,null,null,null,null,null,null,null,null,null,null,null,null,null,null,null,null,null,null,9]
[null,null,null,null,null,null,null,null,null,null,null,null,null,null,null,null,null,null,null,10]
[null,null,null,null,null,null,null,null,null,null,null,null,null,null,null,null,null,null,null,11]
[null,null,null,null,null,null,null,null,null,null,null,null,null,null,null,null,null,null,null,12]
[null,null,null,null,null,null,null,null,null,null,null,null,null,null,null,null,null,null,null,13]
[null,null,null,null,null,null,null,null,null,null,null,null,null,null,null,null,null,null,null,14]
[null,null,null,null,null,null,null,null,null,null,null,null,null,null,null,null,null,null,null,15]
{"$rows_left_out":46}
{"sheet":"ELENCHI","index":4,"n_rows":6,"n_cols":2,"rows_kept":6,"cut":false,"hidden":true,"merged":[]}
["MACROAREA","PUNTEGGIO"]
[]
["A","SI"]
["B","NO"]
["C"]
["D"]

{"sheet":"Sub_Interventi","index":5,"n_rows":76,"n_cols":61,"rows_kept":76,"cut":false,"hidden":true,"merged":[[1,11,18,11],[19,1,45,1],[46,1,57,1],[58,1,60,1],[61,1,64,1],[1,0,74,0],[1,1,18,1],[1,8,45,8],[1,9,45,9],[1,10,45,10],[66,1,72,1],[73,1,74,1],[1,57,45,57],[1,58,45,58],[1,59,18,59],[1,40,45,40],[1,41,45,41],[1,42,45,42],[1,43,18,43],[1,48,45,48],[1,49,45,49],[1,50,45,50],[1,51,18,51],[1,56,45,56],[1,35,18,35],[1,16,45,16],[1,17,45,17],[1,18,45,18],[1,19,18,19],[1,24,45,24],[1,26,45,26],[1,27,18,27],[1,32,45,32],[1,33,45,33],[1,34,45,34],[1,25,45,25]]}
["Tipologia di intervento","Intervento                                                ",null,"art. 45 reg. 1305/13","Sub intervento                                                                     ","n°","OK",411]
[411,"Costruzioni/ristrutturazioni di immobili produttivi\n\n0002\n\nmq",2,"A","Altri opifici",1,"X",{"$f":"CONCATENATE($H$1,TEXT(C2,\"0000\"),D2,TEXT(F2,\"0000\"),\" -\",E2,)","v":"4110002A0001 -Altri opifici"},null,null,null,null,null,null,null,null,null,null,null,"c) spese generali collegate alle spese;","onorari di architetti, ingegneri e consulenti in genere",null,null,null,null,null,null,"c) spese generali collegate alle spese;","onorari di architetti, ingegneri e consulenti in genere",null,null,null,null,null,null,"c) spese generali collegate alle spese;","onorari di architetti, ingegneri e consulenti in genere",null,null,null,null,null,null,"c) spese generali collegate alle spese;","onorari di architetti, ingegneri e consulenti in genere",null,null,null,null,null,null,"c) spese generali collegate alle spese;","onorari di architetti, ingegneri e consulenti in genere",null,null,null,null,null,null,"c) spese generali collegate alle spese;","onorari di architetti, ingegneri e consulenti in genere"]
[null,null,2,"A","Cantine",2,"X",{"$f":"CONCATENATE($H$1,TEXT(C3,\"0000\"),D3,TEXT(F3,\"0000\"),\" -\",E3,)","v":"4110002A0002 -Cantine"}]
[null,null,2,"A","Caseifici per latte bovino ",3,"X","4110002A0003 -Caseifici per latte bovino "]
[null,null,2,"A","Caseifici per latte bufalino",4,"X","4110002A0004 -Caseifici per latte bufalino"]
[null,null,2,"A","Lavorazione ortofrutta",5,"X","4110002A0005 -Lavorazione ortofrutta"]
[null,null,2,"A","Locali per la vendita diretta",6,"X","4110002A0006 -Locali per la vendita diretta"]
[null,null,2,"A","Oleifici",7,"X","4110002A0007 -Oleifici"]
[null,null,2,"A","Serre per Floricoltura",8,"X","4110002A0008 -Serre per Floricoltura"]
[null,null,2,"A","Serre per Frutticoltura",9,"X","4110002A0009 -Serre per Frutticoltura"]
[null,null,2,"A","Serre per Orticoltura",10,"X","4110002A0010 -Serre per Orticoltura"]
[null,null,2,"A","Serre per Vivaismo",11,"X","4110002A0011 -Serre per Vivaismo"]
[null,null,2,"A","Strutture di allevamento per Altro",12,"X","4110002A0012 -Strutture di allevamento per Altro"]
[null,null,2,"A","Strutture di allevamento per Avicoli",13,"X","4110002A0013 -Strutture di allevamento per Avicoli"]
[null,null,2,"A","Strutture di allevamento per Bovini",14,"X","4110002A0014 -Strutture di allevamento per Bovini"]
{"$rows_left_out":61}